Erreur de compilation - 0.4.16

French
User avatar
shiva
Member
 
Posts: 107
Joined: Tue Sep 16, 2014 22:00
Location: En Bretagne :-)
In-game: shiva35

Erreur de compilation - 0.4.16

by shiva » Sun Jul 09, 2017 16:55

Slt à tous,

Je viens de tester une compilation de la toute dernière version récupérée sur github, et malheureusement ça plante.
Le système : Debian Jessie à jour.
Commandes lancées :
Code: Select all
git clone --depth 1 https://github.com/minetest/minetest.git minetest-0.4.16
cd minetest-0.4.16
git clone --depth 1 https://github.com/minetest/minetest_game.git games/minetest_game
cmake . -DRUN_IN_PLACE=TRUE -DBUILD_CLIENT=TRUE -DBUILD_SERVER=TRUE -DENABLE_POSTGRESQL=TRUE
make -j 4

Erreurs :
Code: Select all
Linking CXX executable ../bin/minetestserver
[ 54%] Building CXX object src/CMakeFiles/minetest.dir/script/lua_api/l_minimap.cpp.o
CMakeFiles/minetestserver.dir/convert_json.cpp.o: dans la fonction « fetchJsonValue(std::string const&, std::vector<std::string, std::allocator<std::string> >*) »:
convert_json.cpp:(.text+0x3cfe): référence indéfinie vers « Json::Value::Value(Json::Value&&) »
CMakeFiles/minetestserver.dir/serverlist.cpp.o: dans la fonction « ServerList::deleteEntry(Json::Value const&) »:
serverlist.cpp:(.text+0x22c7): référence indéfinie vers « Json::Value::Value(Json::Value&&) »
serverlist.cpp:(.text+0x230d): référence indéfinie vers « Json::Value::Value(Json::Value&&) »
serverlist.cpp:(.text+0x2339): référence indéfinie vers « Json::Value::Value(Json::Value&&) »
serverlist.cpp:(.text+0x2365): référence indéfinie vers « Json::Value::Value(Json::Value&&) »
CMakeFiles/minetestserver.dir/serverlist.cpp.o:serverlist.cpp:(.text+0x239d): encore plus de références indéfinies suivent vers « Json::Value::Value(Json::Value&&) »
collect2: error: ld returned 1 exit status
src/CMakeFiles/minetestserver.dir/build.make:4296: recipe for target 'bin/minetestserver' failed
make[2]: *** [bin/minetestserver] Error 1
CMakeFiles/Makefile2:216: recipe for target 'src/CMakeFiles/minetestserver.dir/all' failed
make[1]: *** [src/CMakeFiles/minetestserver.dir/all] Error 2

Une idée ?
 

User avatar
shiva
Member
 
Posts: 107
Joined: Tue Sep 16, 2014 22:00
Location: En Bretagne :-)
In-game: shiva35

Re: Erreur de compilation - 0.4.16

by shiva » Sun Jul 09, 2017 17:02

Oubliez mon post, la réponse est là : viewtopic.php?f=6&t=18020
Tout est ok maintenant :-)
 


Return to Français



Who is online

Users browsing this forum: No registered users and 1 guest